{"text_format":"1","workbook":"xlsx","n_sheets":6,"sheets":["ANEXO B1","DADOS-A","APROXIMAÇÃO-B","DECOLAGEM-C","TRANSIÇÃO-D","APROX_DEP_CURVA-E"],"not_rendered":{"charts":0,"images":1,"macros":1,"external_links":1,"defined_names":18,"comments":0,"pivot_tables":0},"unopened":[],"bounds":{"document_bytes":16777216,"sheet_cells":100000,"rows_first":2000,"rows_last":500,"rows_between":2000,"halvings":0,"cell_chars":16384,"cell_head_chars":4096},"cells_cut":0,"cells_raw":0,"read":"whole","date_system":"1900"}

{"sheet":"ANEXO B1","index":0,"n_rows":91,"n_cols":4,"rows_kept":91,"cut":false,"hidden":false,"merged":[[14,2,14,3],[0,0,0,3],[2,0,2,3],[5,2,5,3],[6,2,6,3],[7,2,7,3],[8,2,8,3],[12,2,12,3],[13,2,13,3],[78,2,78,3],[79,2,79,3],[15,2,15,3],[16,2,16,3],[18,2,18,3],[21,2,21,3],[24,0,24,3],[77,2,77,3]]}
["\nCOMANDO DA AERONÁUTICA\nFICHA INFORMATIVA DE HELIPONTOS (VFR/IFR Não Precisão)\nAnexo B1 à ICA 63-19"]
[]
["Características do Heliponto"]
[]
["A"," Dados Gerais do Heliponto:"]
["A1","Denominação do Heliponto:",{"$f":"'DADOS-A'!C1","v":0}]
["A2","Código OACI:",{"$f":"'DADOS-A'!C2","v":0}]
["A3","HRP (Latitude):",{"$f":"'DADOS-A'!C3","v":0}]
["A4","HRP (Longitude):",{"$f":"'DADOS-A'!C4","v":0}]
["A5","Elevação (m):",{"$f":"'DADOS-A'!C5","v":0},{"$f":"'DADOS-A'!D5","v":0}]
["A6","Máxima dimensão do helicóptero crítico em operação (m):",{"$f":"'DADOS-A'!C6","v":0},{"$f":"'DADOS-A'!D6","v":0}]
["A7","Diâmetro do rotor do helicóptero crítico em operação (m):",{"$f":"'DADOS-A'!C7","v":0},{"$f":"'DADOS-A'!D7","v":0}]
["A8","Classe de performance do helicóptero crítico em operação:",{"$f":"'DADOS-A'!C8","v":0}]
["A9","Tipo de operação",{"$f":"'DADOS-A'!C9","v":0}]
["A10","Período de operação",{"$f":"'DADOS-A'!C10","v":0}]
["A11","Tipo de Heliponto: ",{"$f":"'DADOS-A'!C11","v":0}]
["A12","Formato da FATO:",{"$f":"'DADOS-A'!C12","v":0}]
["A13","Dimensões da FATO (comp. x larg.) (m):",{"$f":"'DADOS-A'!C13","v":0},{"$f":"'DADOS-A'!D13","v":0}]
["A14","Formato da TLOF:",{"$f":"'DADOS-A'!C14","v":0}]
["A15","Dimensões da TLOF (comp. x larg.) (m):",{"$f":"'DADOS-A'!C15","v":0},{"$f":"'DADOS-A'!D15","v":0}]
["A16","Dimensões da Área de Segurança Operacional  (comp. x larg.) (m):",{"$f":"'DADOS-A'!C16","v":0},{"$f":"'DADOS-A'!D16","v":0}]
["A17","Zona desimpedida:",{"$f":"'DADOS-A'!C17","v":0}]
["A18","Dimensão  (comp. x larg.) (m):",{"$f":"'DADOS-A'!C18","v":0},{"$f":"'DADOS-A'!D18","v":0}]
[]
["Características das Superfícies Limitadoras de Obstáculos"]
[]
["B","Superfície de Aproximação em linha reta:","Superfície 1","Superfície 2"]
["B1","Número: ",{"$f":"'APROXIMAÇÃO-B'!C2","v":0},{"$f":"'APROXIMAÇÃO-B'!D2","v":0}]
["B2","Rumo verdadeiro: ",{"$f":"'APROXIMAÇÃO-B'!C3","v":0},{"$f":"'APROXIMAÇÃO-B'!D3","v":0}]
[null,"Primeira Seção",{"$f":"'APROXIMAÇÃO-B'!C4","v":0},{"$f":"'APROXIMAÇÃO-B'!D4","v":0}]
["B3","Largura da borda interna (m):",{"$f":"'APROXIMAÇÃO-B'!C5","v":0},{"$f":"'APROXIMAÇÃO-B'!D5","v":0}]
["B4","Elevação da borda interna (m):",{"$f":"'APROXIMAÇÃO-B'!C6","v":0},{"$f":"'APROXIMAÇÃO-B'!D6","v":0}]
["B5","Localização da borda interna:",{"$f":"'APROXIMAÇÃO-B'!C7","v":"MARGINAL À AREA DE SEGURANÇA OPERACIONAL"},{"$f":"'APROXIMAÇÃO-B'!D7","v":"MARGINAL À AREA DE SEGURANÇA OPERACIONAL"}]
["B6","Abertura para cada lado (%):",{"$f":"'APROXIMAÇÃO-B'!C8","v":0.16},{"$f":"'APROXIMAÇÃO-B'!D8","v":0.16}]
["B7","Comprimento (m):",{"$f":"'APROXIMAÇÃO-B'!C9","v":2500},{"$f":"'APROXIMAÇÃO-B'!D9","v":2500}]
["B8","Largura externa (m):",{"$f":"'APROXIMAÇÃO-B'!C10","v":890},{"$f":"'APROXIMAÇÃO-B'!D10","v":890}]
["B9","Gradiente (%):",{"$f":"'APROXIMAÇÃO-B'!C11","v":3.3300000000000003E-2},{"$f":"'APROXIMAÇÃO-B'!D11","v":3.3300000000000003E-2}]
["B10","Altitude acima da FATO (m):",{"$f":"'APROXIMAÇÃO-B'!C12","v":83.250000000000014},{"$f":"'APROXIMAÇÃO-B'!D12","v":83.250000000000014}]
[null,"Segunda Seção",{"$f":"'APROXIMAÇÃO-B'!C13","v":0},{"$f":"'APROXIMAÇÃO-B'!D13","v":0}]
["B11","Largura da borda interna (m):",{"$f":"'APROXIMAÇÃO-B'!C14","v":0},{"$f":"'APROXIMAÇÃO-B'!D14","v":0}]
["B12","Elevação da borda interna (m):",{"$f":"'APROXIMAÇÃO-B'!C15","v":0},{"$f":"'APROXIMAÇÃO-B'!D15","v":0}]
["B13","Abertura para cada lado (%):",{"$f":"'APROXIMAÇÃO-B'!C16","v":0},{"$f":"'APROXIMAÇÃO-B'!D16","v":0}]
["B14","Comprimento (m):",{"$f":"'APROXIMAÇÃO-B'!C17","v":0},{"$f":"'APROXIMAÇÃO-B'!D17","v":0}]
["B15","Largura externa (m):",{"$f":"'APROXIMAÇÃO-B'!C18","v":0},{"$f":"'APROXIMAÇÃO-B'!D18","v":0}]
["B16","Gradiente (%):",{"$f":"'APROXIMAÇÃO-B'!C19","v":0},{"$f":"'APROXIMAÇÃO-B'!D19","v":0}]
["B17","Altitude acima da FATO (m):",{"$f":"'APROXIMAÇÃO-B'!C20","v":0},{"$f":"'APROXIMAÇÃO-B'!D20","v":0}]
["B18","Comprimento total (m):",{"$f":"'APROXIMAÇÃO-B'!C21","v":2500},{"$f":"'APROXIMAÇÃO-B'!D21","v":2500}]
["C","Superfície de Decolagem em linha reta:","Superfície 1","Superfície 2"]
["C1","Número: ",{"$f":"'DECOLAGEM-C'!C2","v":18},{"$f":"'DECOLAGEM-C'!D2","v":18}]
["C2","Rumo verdadeiro: ",{"$f":"'DECOLAGEM-C'!C3","v":1800000},{"$f":"'DECOLAGEM-C'!D3","v":1800000}]
[null,"Primeira Seção",{"$f":"'DECOLAGEM-C'!C4","v":0},{"$f":"'DECOLAGEM-C'!D4","v":0}]
["C3","Largura da borda interna (m):",{"$f":"'DECOLAGEM-C'!C5","v":90},{"$f":"'DECOLAGEM-C'!D5","v":90}]
["C4","Elevação da borda interna (m):",{"$f":"'DECOLAGEM-C'!C6","v":0},{"$f":"'DECOLAGEM-C'!D6","v":0}]
["C5","Localização da borda interna:",{"$f":"'DECOLAGEM-C'!C7","v":"MARGINAL À AREA DE SEGURANÇA OPERACIONAL OU CLEARWAY"},{"$f":"'DECOLAGEM-C'!D7","v":"MARGINAL À AREA DE SEGURANÇA OPERACIONAL OU CLEARWAY"}]
["C6","Abertura para cada lado (%):",{"$f":"'DECOLAGEM-C'!C8","v":0.15},{"$f":"'DECOLAGEM-C'!D8","v":0.15}]
["C7","Comprimento (m):",{"$f":"'DECOLAGEM-C'!C9","v":2850},{"$f":"'DECOLAGEM-C'!D9","v":2850}]
["C8","Largura externa (m):",{"$f":"'DECOLAGEM-C'!C10","v":1800},{"$f":"'DECOLAGEM-C'!D10","v":1800}]
["C9","Gradiente (%):",{"$f":"'DECOLAGEM-C'!C11","v":3.5000000000000003E-2},{"$f":"'DECOLAGEM-C'!D11","v":3.5000000000000003E-2}]
["C10","Altitude acima da FATO (m):",{"$f":"'DECOLAGEM-C'!C12","v":99.750000000000014},{"$f":"'DECOLAGEM-C'!D12","v":99.750000000000014}]
[null,"Segunda Seção",{"$f":"'DECOLAGEM-C'!C13","v":0},{"$f":"'DECOLAGEM-C'!D13","v":0}]
["C11","Largura da borda interna (m):",{"$f":"'DECOLAGEM-C'!C14","v":0},{"$f":"'DECOLAGEM-C'!D14","v":0}]
["C12","Elevação da borda interna (m):",{"$f":"'DECOLAGEM-C'!C15","v":0},{"$f":"'DECOLAGEM-C'!D15","v":0}]
["C13","Abertura para cada lado (%):",{"$f":"'DECOLAGEM-C'!C16","v":0},{"$f":"'DECOLAGEM-C'!D16","v":0}]
["C14","Comprimento (m):",{"$f":"'DECOLAGEM-C'!C17","v":0},{"$f":"'DECOLAGEM-C'!D17","v":0}]
["C15","Largura externa (m):",{"$f":"'DECOLAGEM-C'!C18","v":0},{"$f":"'DECOLAGEM-C'!D18","v":0}]
["C16","Gradiente (%):",{"$f":"'DECOLAGEM-C'!C19","v":0},{"$f":"'DECOLAGEM-C'!D19","v":0}]
["C17","Altitude acima da FATO (m):",{"$f":"'DECOLAGEM-C'!C20","v":0},{"$f":"'DECOLAGEM-C'!D20","v":0}]
[null,"Terceira Seção",{"$f":"'DECOLAGEM-C'!C21","v":0},{"$f":"'DECOLAGEM-C'!D21","v":0}]
["C18","Largura da borda interna (m):",{"$f":"'DECOLAGEM-C'!C22","v":0},{"$f":"'DECOLAGEM-C'!D22","v":0}]
["C19","Elevação da borda interna (m):",{"$f":"'DECOLAGEM-C'!C23","v":0},{"$f":"'DECOLAGEM-C'!D23","v":0}]
["C20","Abertura para cada lado (%):",{"$f":"'DECOLAGEM-C'!C24","v":0},{"$f":"'DECOLAGEM-C'!D24","v":0}]
["C21","Comprimento (m):",{"$f":"'DECOLAGEM-C'!C25","v":0},{"$f":"'DECOLAGEM-C'!D25","v":0}]
["C22","Largura externa (m):",{"$f":"'DECOLAGEM-C'!C26","v":0},{"$f":"'DECOLAGEM-C'!D26","v":0}]
["C23","Gradiente (%):",{"$f":"'DECOLAGEM-C'!C27","v":0},{"$f":"'DECOLAGEM-C'!D27","v":0}]
["C24","Altitude acima da FATO (m):",{"$f":"'DECOLAGEM-C'!C28","v":0},{"$f":"'DECOLAGEM-C'!D28","v":0}]
["C25","Comprimento total (m):",{"$f":"'DECOLAGEM-C'!C29","v":2850},{"$f":"'DECOLAGEM-C'!D29","v":2850}]
[]
["D","Superfície de Transição:"]
["D1","Gradiente (%):",{"$f":"'TRANSIÇÃO-D'!C2","v":"NA"}]
["D2","Altitude (m):",{"$f":"'TRANSIÇÃO-D'!C3","v":"NA"}]
[]
["E","Superfície de Aproximação / Decolagem em curva:","Superfície 1","Superfície 2"]
["E1","Mudança de Direção:",{"$f":"'APROX_DEP_CURVA-E'!C2","v":0},{"$f":"'APROX_DEP_CURVA-E'!D2","v":0}]
["E2","Raio de curva na linha central (m):",{"$f":"'APROX_DEP_CURVA-E'!C3","v":"CORRIGIR PARA >= 270 m"},{"$f":"'APROX_DEP_CURVA-E'!D3","v":"CORRIGIR PARA >= 270 m"}]
["E3","Distância do portão interno (m):",{"$f":"'APROX_DEP_CURVA-E'!C4","v":"CORRIGIR PARA DIST. >= 575"},{"$f":"'APROX_DEP_CURVA-E'!D4","v":"CORRIGIR PARA DIST. >= 575"}]
["E4","Largura do portão interno (m):",{"$f":"'APROX_DEP_CURVA-E'!C5","v":0},{"$f":"'APROX_DEP_CURVA-E'!D5","v":0}]
["E5","Largura do portão externo (m):",{"$f":"'APROX_DEP_CURVA-E'!C6","v":0},{"$f":"'APROX_DEP_CURVA-E'!D6","v":{"$error":"#VALUE!"}}]
["E6","Elevação do portão interno (m):",{"$f":"'APROX_DEP_CURVA-E'!C7","v":{"$error":"#VALUE!"}},{"$f":"'APROX_DEP_CURVA-E'!D7","v":{"$error":"#VALUE!"}}]
["E7","Elevação do portão externo (m):",{"$f":"'APROX_DEP_CURVA-E'!C8","v":0},{"$f":"'APROX_DEP_CURVA-E'!D8","v":{"$error":"#VALUE!"}}]
["E8","Gradiente (%):",{"$f":"'APROX_DEP_CURVA-E'!C9","v":3.3300000000000003E-2},{"$f":"'APROX_DEP_CURVA-E'!D9","v":3.3300000000000003E-2}]
["E9","Abertura para cada lado (%):",{"$f":"'APROX_DEP_CURVA-E'!C10","v":0.15},{"$f":"'APROX_DEP_CURVA-E'!D10","v":0.15}]

{"sheet":"DADOS-A","index":1,"n_rows":30,"n_cols":12,"rows_kept":30,"cut":false,"hidden":true,"merged":[[11,2,11,3],[13,2,13,3],[16,2,16,3],[8,2,8,3],[0,2,0,3],[1,2,1,3],[7,2,7,3],[9,2,9,3],[10,2,10,3]]}
["A1","Denominação do Heliponto:",null,null,"CLASSE 1","VFR","DIURNO","SUPERFÍCIE","QUADRADO","QUADRADA","APLICÁVEL","SIM"]
["A2","Código OACI:",null,null,"CLASSE 2","IFR NÃO PRECISÃO","NOTURNO","ELEVADO","RETANGULAR","RETANGULAR","NÃO APLICÁVEL","NÃO"]
["A3","HRP (Latitude):",{"$f":"C25","v":0},"S","CLASSE 3",null,"DIURNO / NOTURNO",null,"CIRCULAR"]
["A4","HRP (Longitude):",{"$f":"D25","v":0},"W"]
["A5","Elevação (m):"]
["A6","Máxima dimensão do helicóptero crítico em operação (m):"]
["A7","Diâmetro do rotor do helicóptero crítico em operação (m):"]
["A8","Classe de performance do helicóptero crítico em operação:"]
["A9","Tipo de operação"]
["A10","Período de operação"]
["A11","Tipo de Heliponto: ",null,null,null,null,null,"SUPERFÍCIE"]
["A12","Formato da FATO:"]
["A13","Dimensões da FATO (comp. x larg.) (m):"]
["A14","Formato da TLOF:"]
["A15","Dimensões da TLOF (comp. x larg.) (m):"]
["A16","Dimensões da Área de Segurança Operacional  (comp. x larg.) (m):"]
["A17","Zona desimpedida:"]
["A18","Dimensão  (comp. x larg.) (m):"]
[]
[]
[]
[]
[]
[]
[null,null,{"$f":"C21*10000+C22*100+C23","v":0},{"$f":"D21*10000+D22*100+D23","v":0}]
[]
[null,"HELIPONTO COM PROCEDIMENTO PINS E VSS"]
[]
[]
[null,"DECLINAÇÃO"]

{"sheet":"APROXIMAÇÃO-B","index":2,"n_rows":38,"n_cols":4,"rows_kept":38,"cut":false,"hidden":true,"merged":[]}
["B","Superfície de Aproximação em linha reta:","Superfície 1","Superfície 2"]
["B1","Número: ",{"$f":"C37","v":0},{"$f":"D37","v":0}]
["B2","Rumo verdadeiro: ",{"$f":"C22*10000+C23*100+C24","v":0},{"$f":"C25*10000+C26*100+C27","v":0}]
[null,"Primeira Seção",{"$f":"IF(C38=\"abertura não permitida\",C38,0)","v":0}]
["B3","Largura da borda interna (m):",{"$f":"'DADOS-A'!$D$16","v":0},{"$f":"'DADOS-A'!$D$16","v":0}]
["B4","Elevação da borda interna (m):",{"$f":"'DADOS-A'!$C$5","v":0},{"$f":"'DADOS-A'!$C$5","v":0}]
["B5","Localização da borda interna:","MARGINAL À AREA DE SEGURANÇA OPERACIONAL","MARGINAL À AREA DE SEGURANÇA OPERACIONAL"]
["B6","Abertura para cada lado (%):",{"$f":"IF('DADOS-A'!$C$10='DADOS-A'!$G$1,IF('DADOS-A'!$C$9='DADOS-A'!$F$1,0.1,0.16),IF('DADOS-A'!$C$9='DADOS-A'!$F$1,0.15,0.16))","v":0.16},{"$f":"C8","v":0.16}]
["B7","Comprimento (m):",{"$f":"IF('DADOS-A'!$C$9=\"VFR\",IF('DADOS-A'!$C$8=\"CLASSE 1\",3386,IF('DADOS-A'!$C$8=\"CLASSE 2\",1220,245)),2500)","v":2500},{"$f":"C9","v":2500}]
["B8","Largura externa (m):",{"$f":"IF('DADOS-A'!$C$9=\"VFR\",IF('DADOS-A'!$C$10=\"DIURNO\",IF('DADOS-A'!$C$8=\"CLASSE 3\",'DADOS-A'!$D$16+(2*'APROXIMAÇÃO-B'!C8*'APROXIMAÇÃO-B'!C9),(7*'DADOS-A'!$C$7)),IF('DADOS-A'!$C$8=\"CLASSE 3\",'DADOS-A'!$D$16+(2*'APROXIMAÇÃO-B'!C8*'APROXIMAÇÃO-B'!C9),(10*'DADOS-A'!$C$7))),890)","v":890},890]
["B9","Gradiente (%):",{"$f":"IF('DADOS-A'!$C$9=\"VFR\",IF('DADOS-A'!$C$8=\"CLASSE 1\",0.045,IF('DADOS-A'!$C$8=\"CLASSE 2\",0.125,0.08)),0.0333)","v":3.3300000000000003E-2},3.3300000000000003E-2]
["B10","Altitude acima da FATO (m):",{"$f":"C6+(C9*C11)","v":83.250000000000014},{"$f":"D6+(D9*D11)","v":83.250000000000014}]
[null,"Segunda Seção"]
["B11","Largura da borda interna (m):",{"$f":"IF(AND('DADOS-A'!$C$8=\"CLASSE 3\",'DADOS-A'!$C$9=\"VFR\"),IF('DADOS-A'!$C$10=\"DIURNO\",(C5+C9*0.2),(C5+C9*0.3)),0)","v":0},{"$f":"C14","v":0}]
["B12","Elevação da borda interna (m):",{"$f":"IF(AND('DADOS-A'!$C$8=\"CLASSE 3\",'DADOS-A'!$C$9=\"VFR\"),C12,0)","v":0},{"$f":"C15","v":0}]
["B13","Abertura para cada lado (%):",{"$f":"IF(AND('DADOS-A'!$C$8=\"CLASSE 3\",'DADOS-A'!$C$9=\"VFR\"),IF('DADOS-A'!$C$10=\"DIURNO\",0.1,0.15),0)","v":0},0]
["B14","Comprimento (m):",{"$f":"IF(AND('DADOS-A'!$C$8=\"CLASSE 3\",'DADOS-A'!$C$9=\"VFR\"),830,0)","v":0},0]
["B15","Largura externa (m):",{"$f":"IF(AND('DADOS-A'!$C$8=\"CLASSE 3\",'DADOS-A'!$C$9=\"VFR\"),IF('DADOS-A'!$C$10=\"DIURNO\",IF('DADOS-A'!$C$7*7<C10,C10,'DADOS-A'!$C$7*7),IF('DADOS-A'!$C$7*10<C10,C10,'DADOS-A'!$C$7*10)),0)","v":0},0]
["B16","Gradiente (%):",{"$f":"IF(AND('DADOS-A'!$C$8=\"CLASSE 3\",'DADOS-A'!$C$9=\"VFR\"),0.16,0)","v":0},0]
["B17","Altitude acima da FATO (m):",{"$f":"IF(AND('DADOS-A'!$C$8=\"CLASSE 3\",'DADOS-A'!$C$9=\"VFR\"),C6+152,0)","v":0},0]
["B18","Comprimento total (m):",{"$f":"C9+C17","v":2500},{"$f":"D9+D17","v":2500}]
[]
[]
[]
[]
[]
[]
[]
[]
[]
[]
[]
[]
[]
[null,"DECLINAÇÃO",null,{"$f":"C35","v":0}]
[null,null,{"$f":"C22+(C23/60+C24/3600)","v":0},{"$f":"C25+(C26/60+C27/3600)","v":0}]
[null,null,{"$f":"IF((C36-C35)>360,(C36-C35-360)/10,(C36-C35)/10)","v":0},{"$f":"IF((D36-D35)>360,(D36-D35-360)/10,(D36-D35)/10)","v":0}]
[null,null,{"$f":"IF(D36=0,\"OK\",IF(ABS(C36-D36)<150,\"ABERTURA NÃO PERMITIDA\",\"OK\"))","v":"OK"}]

{"sheet":"DECOLAGEM-C","index":3,"n_rows":32,"n_cols":4,"rows_kept":32,"cut":false,"hidden":true,"merged":[]}
["C","Superfície de Decolagem em linha reta:","Superfície 1","Superfície 2"]
["C1","Número: ",{"$f":"IF('APROXIMAÇÃO-B'!C2+18>36,'APROXIMAÇÃO-B'!C2-18,'APROXIMAÇÃO-B'!C2+18)","v":18},{"$f":"IF('APROXIMAÇÃO-B'!D2+18>36,'APROXIMAÇÃO-B'!D2-18,'APROXIMAÇÃO-B'!D2+18)","v":18}]
["C2","Rumo verdadeiro: ",{"$f":"C32*10000+'APROXIMAÇÃO-B'!C23*100+'APROXIMAÇÃO-B'!C24","v":1800000},{"$f":"D32*10000+'APROXIMAÇÃO-B'!C26*100+'APROXIMAÇÃO-B'!C27","v":1800000}]
[null,"Primeira Seção"]
["C3","Largura da borda interna (m):",{"$f":"IF('DADOS-A'!$C$9=\"vfr\",'DADOS-A'!$D$16,90)","v":90},{"$f":"IF('DADOS-A'!$C$9=\"vfr\",'DADOS-A'!$D$16,90)","v":90}]
["C4","Elevação da borda interna (m):",{"$f":"'DADOS-A'!$C$5","v":0},{"$f":"'DADOS-A'!$C$5","v":0}]
["C5","Localização da borda interna:","MARGINAL À AREA DE SEGURANÇA OPERACIONAL OU CLEARWAY","MARGINAL À AREA DE SEGURANÇA OPERACIONAL OU CLEARWAY"]
["C6","Abertura para cada lado (%):",{"$f":"IF('DADOS-A'!$C$9='DADOS-A'!$F$2,0.3,IF('DADOS-A'!$C$10='DADOS-A'!$G$1,0.1,0.15))","v":0.15},{"$f":"C8","v":0.15}]
["C7","Comprimento (m):",{"$f":"IF('DADOS-A'!$C$9=\"vfr\",IF('DADOS-A'!$C$8=\"CLASSE 1\",3386,IF('DADOS-A'!$C$8=\"CLASSE 2\",1220,245)),2850)","v":2850},{"$f":"C9","v":2850}]
["C8","Largura externa (m):",{"$f":"IF('DADOS-A'!$C$9=\"vfr\",IF('DADOS-A'!$C$8=\"CLASSE 3\",(2*C8*C9)+C5,IF('DADOS-A'!$C$10=\"DIURNO\",7*'DADOS-A'!$C$7,'DADOS-A'!$C$7*10)),1800)","v":1800},{"$f":"C10","v":1800}]
["C9","Gradiente (%):",{"$f":"IF('DADOS-A'!$C$9=\"vfr\",IF('DADOS-A'!$C$8=\"CLASSE 1\",0.045,IF('DADOS-A'!$C$8=\"CLASSE 2\",0.125,0.08)),0.035)","v":3.5000000000000003E-2},{"$f":"C11","v":3.5000000000000003E-2}]
["C10","Altitude acima da FATO (m):",{"$f":"C6+(C9*C11)","v":99.750000000000014},{"$f":"D6+(D9*D11)","v":99.750000000000014}]
[null,"Segunda Seção"]
["C11","Largura da borda interna (m):",{"$f":"IF('DADOS-A'!$C$9=\"IFR NÃO PRECISÃO\",1800,IF('DADOS-A'!$C$8=\"CLASSE 3\",IF('DADOS-A'!$C$10=\"diurno\",C5+C9*0.2,C5+C9*0.3),0))","v":0},{"$f":"C14","v":0}]
["C12","Elevação da borda interna (m):",{"$f":"IF(AND('DADOS-A'!$C$8=\"CLASSE 3\",'DADOS-A'!$C$9=\"VFR\"),C12,IF('DADOS-A'!$C$9=\"IFR NÃO PRECISÃO\",C12,0))","v":0},0]
["C13","Abertura para cada lado (%):",{"$f":"IF(AND('DADOS-A'!$C$8=\"CLASSE 3\",'DADOS-A'!$C$9=\"VFR\"),IF('DADOS-A'!$C$10=\"DIURNO\",0.1,0.15),IF('DADOS-A'!$C$9=\"IFR NÃO PRECISÃO\",\"PARALELA\",0))","v":0},0]
["C14","Comprimento (m):",{"$f":"IF(AND('DADOS-A'!$C$8=\"CLASSE 3\",'DADOS-A'!$C$9=\"VFR\"),830,IF('DADOS-A'!$C$9=\"IFR NÃO PRECISÃO\",1510,0))","v":0},0]
["C15","Largura externa (m):",{"$f":"IF(AND('DADOS-A'!$C$8=\"CLASSE 3\",'DADOS-A'!$C$9=\"VFR\"),IF('DADOS-A'!$C$10=\"DIURNO\",IF('DADOS-A'!$C$7*7<C10,C10,'DADOS-A'!$C$7*7),IF('DADOS-A'!$C$7*10<C10,C10,'DADOS-A'!$C$7*10)),IF('DADOS-A'!$C$9=\"ifr não precisão\",1800,0))","v":0},0]
["C16","Gradiente (%):",{"$f":"IF(AND('DADOS-A'!$C$8=\"CLASSE 3\",'DADOS-A'!$C$9=\"VFR\"),0.16,IF('DADOS-A'!$C$9=\"IFR NÃO PRECISÃO\",0.035,0))","v":0},0]
["C17","Altitude acima da FATO (m):",{"$f":"IF(AND('DADOS-A'!$C$8=\"CLASSE 3\",'DADOS-A'!$C$9=\"VFR\"),C6+152,IF('DADOS-A'!$C$9=\"IFR NÃO PRECISÃO\",C6+152,0))","v":0},0]
[null,"Terceira Seção"]
["C18","Largura da borda interna (m):",{"$f":"IF('DADOS-A'!$C$9=\"IFR NÃO PRECISÃO\",C18,0)","v":0},{"$f":"IF('DADOS-A'!$C$9=\"IFR NÃO PRECISÃO\",D18,0)","v":0}]
["C19","Elevação da borda interna (m):",{"$f":"IF('DADOS-A'!$C$9=\"IFR NÃO PRECISÃO\",C20,0)","v":0},{"$f":"IF('DADOS-A'!$C$9=\"IFR NÃO PRECISÃO\",D20,0)","v":0}]
["C20","Abertura para cada lado (%):",{"$f":"IF('DADOS-A'!$C$9=\"IFR NÃO PRECISÃO\",\"PARALELA\",0)","v":0},{"$f":"IF('DADOS-A'!$C$9=\"IFR NÃO PRECISÃO\",\"PARALELA\",0)","v":0}]
["C21","Comprimento (m):",{"$f":"IF('DADOS-A'!$C$9=\"IFR NÃO PRECISÃO\",7640,0)","v":0},{"$f":"IF('DADOS-A'!$C$9=\"IFR NÃO PRECISÃO\",7640,0)","v":0}]
["C22","Largura externa (m):",{"$f":"IF('DADOS-A'!$C$9=\"IFR NÃO PRECISÃO\",1800,0)","v":0},{"$f":"IF('DADOS-A'!$C$9=\"IFR NÃO PRECISÃO\",1800,0)","v":0}]
["C23","Gradiente (%):",{"$f":"IF('DADOS-A'!$C$9=\"IFR NÃO PRECISÃO\",0.02,0)","v":0},{"$f":"IF('DADOS-A'!$C$9=\"IFR NÃO PRECISÃO\",0.02,0)","v":0}]
["C24","Altitude acima da FATO (m):",{"$f":"IF('DADOS-A'!$C$9=\"IFR NÃO PRECISÃO\",C6+305,0)","v":0},{"$f":"IF('DADOS-A'!$C$9=\"IFR NÃO PRECISÃO\",D6+305,0)","v":0}]
["C25","Comprimento total (m):",{"$f":"C9+C17+C25","v":2850},{"$f":"D9+D17+D25","v":2850}]
[]
[]
[null,null,{"$f":"IF('APROXIMAÇÃO-B'!C22+180>360,'APROXIMAÇÃO-B'!C22-180,'APROXIMAÇÃO-B'!C22+180)","v":180},{"$f":"IF('APROXIMAÇÃO-B'!C25+180>360,'APROXIMAÇÃO-B'!C25-180,'APROXIMAÇÃO-B'!C25+180)","v":180}]

{"sheet":"TRANSIÇÃO-D","index":4,"n_rows":3,"n_cols":3,"rows_kept":3,"cut":false,"hidden":true,"merged":[[0,2,0,3],[1,2,1,3],[2,2,2,3]]}
["D","Superfície de Transição:"]
["D1","Gradiente (%):",{"$f":"IF('DADOS-A'!$C$27=\"SIM\",IF('DADOS-A'!$C$9=\"VFR\",0.5,0.2),\"NA\")","v":"NA"}]
["D2","Altitude (m):",{"$f":"IF('DADOS-A'!C27=\"SIM\",'DADOS-A'!$C$5+45,\"NA\")","v":"NA"}]

{"sheet":"APROX_DEP_CURVA-E","index":5,"n_rows":15,"n_cols":4,"rows_kept":15,"cut":false,"hidden":true,"merged":[]}
["E","Superfície de Aproximação / Decolagem em curva:","Superfície 1","Superfície 2"]
["E1","Mudança de Direção:",{"$f":"IF(C12>120,\"CORRIGIR PARA <= 120°\",C12)","v":0},{"$f":"IF(D12>120,\"CORRIGIR PARA <= 120°\",D12)","v":0}]
["E2","Raio de curva na linha central (m):",{"$f":"IF(C15<270,\"CORRIGIR PARA >= 270 m\",C15)","v":"CORRIGIR PARA >= 270 m"},{"$f":"IF(D15<270,\"CORRIGIR PARA >= 270 m\",D15)","v":"CORRIGIR PARA >= 270 m"}]
["E3","Distância do portão interno (m):",{"$f":"IF(C13<575-C15,\"CORRIGIR PARA DIST. >= \"&C11,C13)","v":"CORRIGIR PARA DIST. >= 575"},{"$f":"IF(D13<575-D15,\"CORRIGIR PARA DIST. >= \"&D11,D13)","v":"CORRIGIR PARA DIST. >= 575"}]
["E4","Largura do portão interno (m):",{"$f":"MIN('DADOS-A'!$D$16+2*C13*'APROXIMAÇÃO-B'!C8,IF('DADOS-A'!$C$10=\"DIURNO\",7*'DADOS-A'!$C$7,10*'DADOS-A'!$C$7))","v":0},{"$f":"MIN('DADOS-A'!$D$16+2*D13*'APROXIMAÇÃO-B'!D8,IF('DADOS-A'!$C$10=\"DIURNO\",7*'DADOS-A'!$C$7,10*'DADOS-A'!$C$7))","v":0}]
["E5","Largura do portão externo (m):",{"$f":"MIN('DADOS-A'!$D$16+2*C14*'APROXIMAÇÃO-B'!C8,IF('DADOS-A'!$C$10=\"DIURNO\",7*'DADOS-A'!$C$7,10*'DADOS-A'!$C$7))","v":0},{"$f":"MIN('DADOS-A'!$D$16+2*D14*'APROXIMAÇÃO-B'!D8,IF('DADOS-A'!$C$10=\"DIURNO\",7*'DADOS-A'!$C$7,10*'DADOS-A'!$C$7))","v":{"$error":"#VALUE!"}}]
["E6","Elevação do portão interno (m):",{"$f":"'DADOS-A'!$C$5+IF(AND('DADOS-A'!$C$8:$D$8=\"CLASSE 3\",'APROX_DEP_CURVA-E'!C13<245),0.08*C13,IF('DADOS-A'!$C$8:$D$8=\"CLASSE 3\",0.08*245+0.16*(C13-245),C4*C9))","v":{"$error":"#VALUE!"}},{"$f":"'DADOS-A'!$C$5+IF(AND('DADOS-A'!$C$8:$D$8=\"CLASSE 3\",'APROX_DEP_CURVA-E'!D13<245),0.08*D13,IF('DADOS-A'!$C$8:$D$8=\"CLASSE 3\",0.08*245+0.16*(D13-245),D4*D9))","v":{"$error":"#VALUE!"}}]
["E7","Elevação do portão externo (m):",{"$f":"'DADOS-A'!$C$5+IF('DADOS-A'!$C$8:$D$8=\"CLASSE 3\",0.08*245+0.16*(C14-245),C14*C9)","v":0},{"$f":"'DADOS-A'!$C$5+IF('DADOS-A'!$C$8:$D$8=\"CLASSE 3\",0.08*245+0.16*(D14-245),D14*D9)","v":{"$error":"#VALUE!"}}]
["E8","Gradiente (%):",{"$f":"IF(AND('DADOS-A'!$C$8:$D$8=\"CLASSE 3\",'APROX_DEP_CURVA-E'!C13<245),\"8 % E 16 %\",IF('DADOS-A'!$C$8:$D$8=\"CLASSE 3\",0.16,'APROXIMAÇÃO-B'!C11))","v":3.3300000000000003E-2},{"$f":"IF(AND('DADOS-A'!$C$8:$D$8=\"CLASSE 3\",'APROX_DEP_CURVA-E'!D13<245),\"8 % E 16 %\",IF('DADOS-A'!$C$8:$D$8=\"CLASSE 3\",0.16,'APROXIMAÇÃO-B'!D11))","v":3.3300000000000003E-2}]
["E9","Abertura para cada lado (%):",{"$f":"IF('DADOS-A'!$C$10=\"DIURNO\",0.1,0.15)","v":0.15},{"$f":"IF('DADOS-A'!$C$10=\"DIURNO\",0.1,0.15)","v":0.15}]
[null,null,{"$f":"575-C15","v":575},{"$f":"575-D15","v":575}]
[null,"mudança de direção"]
[null,"distância para o portão interno"]
[null,"distância para o portão externo",{"$f":"C13+RADIANS(C12)*C15","v":0},{"$f":"(D2*3.14*D3)/180","v":{"$error":"#VALUE!"}}]
[null,"raio de curva"]